Target
C-C chemokine receptor type 2
Ligand
BDBM50011821
Substrate
Meas. Tech.
ChEMBL_1351558 (CHEMBL3268526)
IC50
4.0±n/a nM
Citation
 Winters, MPTeleha, CAKang, FAMcComsey, DO'Neill, JCHou, CKirchner, TWang, PJohnson, DSui, Z The discovery and SAR of cyclopenta[b]furans as inhibitors of CCR2. Bioorg Med Chem Lett 24:2137-40 (2014)  
Target
Name:
C-C chemokine receptor type 2
Synonyms:
C-C chemokine receptor type 2 (CCR2) CCR2_HUMAN Chemoattractant Cytokine Receptor 2 (CCR2) Monocyte chemotactic protein-1 (MCP-1)
Type:
Enzyme
Mol. Mass.:
41932.32
Organism:
Homo sapiens (Human)
Description:
P41597
Residue:
374
  
Inhibitor
Name:
BDBM50011821
Synonyms:
CHEMBL3263256
Type:
Small organic molecule
Emp. Form.:
C25H34F3N3O4
Mol. Mass.:
497.5504
SMILES:
[H][C@@]12C[C@H](C[C@@]1(CC(CC)O2)C(=O)N1CCc2ncc(cc2C1)C(F)(F)F)NC1CCOCC1OC
: