Target
Orexin receptor type 2
Ligand
BDBM50012601
Substrate
Meas. Tech.
ChEMBL_1351466 (CHEMBL3267682)
Ki
0.300000±n/a nM
Citation
 Roecker, AJMercer, SPHarrell, CMGarson, SLFox, SVGotter, ALPrueksaritanont, TCabalu, TDCui, DLemaire, WWinrow, CJRenger, JJColeman, PJ Discovery of dual orexin receptor antagonists with rat sleep efficacy enabled by expansion of the acetonitrile-assisted/diphosgene-mediated 2,4-dichloropyrimidine synthesis. Bioorg Med Chem Lett 24:2079-85 (2014)  
Target
Name:
Orexin receptor type 2
Synonyms:
HCRTR2 OX2R_HUMAN Orexin receptor type 2 (OR-2) Orexin receptor type 2 (OX2R) Ox-2-R | Ox2-R
Type:
Protein
Mol. Mass.:
50710.53
Organism:
Homo sapiens (Human)
Description:
O43614
Residue:
444
  
Inhibitor
Name:
BDBM50012601
Synonyms:
CHEMBL3260835
Type:
Small organic molecule
Emp. Form.:
C23H26N8OS
Mol. Mass.:
462.571
SMILES:
C[C@@H]1CCN(CCN1C(=O)c1cc(C)ccc1-n1nccn1)c1nc(N)c2c(C)csc2n1
: