Target
Sodium-dependent serotonin transporter
Ligand
BDBM30130
Substrate
Meas. Tech.
ChEMBL_1350019 (CHEMBL3270819)
Ki
5.6±n/a nM
Citation
 Eliás, OAgai-Csongor, EDomány, GKeseru, GMGere, AKiss, BHellinger, EVastag, MGyertyán, I Design of novel multiple-acting ligands towards SERT and 5-HT2C receptors. Bioorg Med Chem Lett 24:2118-22 (2014)  
Target
Name:
Sodium-dependent serotonin transporter
Synonyms:
5-HT Transporter 5HT transporter Anandamid membrane transporter, AMT Monoamine transporters; Norepinephrine & serotonin Slc6a4 Sodium-dependent serotonin transporter (SERT) | imipramine receptor
Type:
Multi-pass membrane protein
Mol. Mass.:
70168.43
Organism:
Rattus norvegicus (rat)
Description:
P31652
Residue:
630
  
Inhibitor
Name:
BDBM30130
Synonyms:
CHEMBL1201082 Fluoxetin Prozac cid_62857
Type:
Small organic molecule
Emp. Form.:
C17H18F3NO
Mol. Mass.:
309.3261
SMILES:
CNCCC(Oc1ccc(cc1)C(F)(F)F)c1ccccc1
: