Target
cAMP and cAMP-inhibited cGMP 3',5'-cyclic phosphodiesterase 10A
Ligand
BDBM50013138
Substrate
Meas. Tech.
ChEMBL_1350908 (CHEMBL3268063)
IC50
42±n/a nM
Citation
 Das, SHarde, RLShelke, DEKhairatkar-Joshi, NBajpai, MSapalya, RSSurve, HVGudi, GSPattem, RBehera, DBJadhav, SBThomas, A Design, synthesis and pharmacological evaluation of novel polycyclic heteroarene ethers as PDE10A inhibitors: Part I. Bioorg Med Chem Lett 24:2073-8 (2014)  
Target
Name:
cAMP and cAMP-inhibited cGMP 3',5'-cyclic phosphodiesterase 10A
Synonyms:
3',5'-cyclic phosphodiesterase PDE10_HUMAN Phosphodiesterase 10A
Type:
Protein
Mol. Mass.:
88412.52
Organism:
Homo sapiens (Human)
Description:
Q9Y233
Residue:
779
  
Inhibitor
Name:
BDBM50013138
Synonyms:
CHEMBL3262291
Type:
Small organic molecule
Emp. Form.:
C24H19FN4O
Mol. Mass.:
398.4323
SMILES:
Cn1c2ccccc2c2cc(CCOc3nccnc3-c3ccc(F)cc3)cnc12
: