Target
cAMP and cAMP-inhibited cGMP 3',5'-cyclic phosphodiesterase 10A
Ligand
BDBM50013152
Substrate
Meas. Tech.
ChEMBL_1350908 (CHEMBL3268063)
IC50
33±n/a nM
Citation
 Das, SHarde, RLShelke, DEKhairatkar-Joshi, NBajpai, MSapalya, RSSurve, HVGudi, GSPattem, RBehera, DBJadhav, SBThomas, A Design, synthesis and pharmacological evaluation of novel polycyclic heteroarene ethers as PDE10A inhibitors: Part I. Bioorg Med Chem Lett 24:2073-8 (2014)  
Target
Name:
cAMP and cAMP-inhibited cGMP 3',5'-cyclic phosphodiesterase 10A
Synonyms:
3',5'-cyclic phosphodiesterase PDE10_HUMAN Phosphodiesterase 10A
Type:
Protein
Mol. Mass.:
88412.52
Organism:
Homo sapiens (Human)
Description:
Q9Y233
Residue:
779
  
Inhibitor
Name:
BDBM50013152
Synonyms:
CHEMBL3262303
Type:
Small organic molecule
Emp. Form.:
C23H17F2N5O
Mol. Mass.:
417.4108
SMILES:
FC(F)n1c2ccccc2c2cc(CCOc3ncccc3-c3cncnc3)cnc12
: