Target
Botulinum neurotoxin type A
Ligand
BDBM50447108
Substrate
Meas. Tech.
ChEMBL_1349201 (CHEMBL3267975)
Ki
77±n/a nM
Citation
 Videnovic, MOpsenica, DMBurnett, JCGomba, LNuss, JESelakovic, ZKonstantinovic, JKrstic, MSegan, SZlatovic, MSciotti, RJBavari, SSolaja, BA Second generation steroidal 4-aminoquinolines are potent, dual-target inhibitors of the botulinum neurotoxin serotype A metalloprotease and P. falciparum malaria. J Med Chem 57:4134-53 (2014)  
Target
Name:
Botulinum neurotoxin type A
Synonyms:
BXA1_CLOBO bonT | botA
Type:
PROTEIN
Mol. Mass.:
149450.01
Organism:
Clostridium botulinum
Description:
ChEMBL_1510137
Residue:
1296
  
Inhibitor
Name:
BDBM50447108
Synonyms:
CHEMBL3112881
Type:
Small organic molecule
Emp. Form.:
C11H7ClFNO2S
Mol. Mass.:
271.695
SMILES:
ONC(=O)\C=C\c1sc2cc(F)ccc2c1Cl
: