Target
Botulinum neurotoxin type A
Ligand
BDBM50013672
Substrate
Meas. Tech.
ChEMBL_1349201 (CHEMBL3267975)
Ki
341±n/a nM
Citation
 Videnovic, MOpsenica, DMBurnett, JCGomba, LNuss, JESelakovic, ZKonstantinovic, JKrstic, MSegan, SZlatovic, MSciotti, RJBavari, SSolaja, BA Second generation steroidal 4-aminoquinolines are potent, dual-target inhibitors of the botulinum neurotoxin serotype A metalloprotease and P. falciparum malaria. J Med Chem 57:4134-53 (2014)  
Target
Name:
Botulinum neurotoxin type A
Synonyms:
BXA1_CLOBO bonT | botA
Type:
PROTEIN
Mol. Mass.:
149450.01
Organism:
Clostridium botulinum
Description:
ChEMBL_1510137
Residue:
1296
  
Inhibitor
Name:
BDBM50013672
Synonyms:
CHEMBL3264508
Type:
Small organic molecule
Emp. Form.:
C50H66Cl2N6O4
Mol. Mass.:
886.003
SMILES:
[H][C@@]1(CC[C@@]2([H])[C@]3([H])[C@@H](C[C@]4([H])CC(CC[C@]4(C)[C@@]3([H])C[C@H](OC(C)=O)[C@]12C)NCCNc1ccnc2cc(Cl)ccc12)OC(C)=O)[C@H](C)CCCNCCNc1ccnc2cc(Cl)ccc12
: