Target
Discoidin domain-containing receptor 2
Ligand
BDBM14847
Substrate
Meas. Tech.
ChEMBL_1350711 (CHEMBL3265735)
IC50
8.0±n/a nM
Citation
 Richters, ANguyen, HDPhan, TSimard, JRGrütter, CEngel, JRauh, D Identification of type II and III DDR2 inhibitors. J Med Chem 57:4252-62 (2014)  
Target
Name:
Discoidin domain-containing receptor 2
Synonyms:
DDR2 Discoidin domain receptor 2 (DDR2) Discoidin domain-containing receptor 2 (DDR2) NTRKR3 TYRO10
Type:
Protein
Mol. Mass.:
96717.07
Organism:
Homo sapiens (Human)
Description:
Q16832
Residue:
855
  
Inhibitor
Name:
BDBM14847
Synonyms:
1-[2-(3-Aminophenyl)-5-tert-butyl-2H-pyrazol-3-yl]-3-[4-(2-morpholin-4-yl-ethoxy)-naphthalen-1-yl]urea BIRB-796 Analog 38 | BIRB-796 derivative, 13
Type:
Small organic molecule
Emp. Form.:
C30H36N6O3
Mol. Mass.:
528.6452
SMILES:
CC(C)(C)c1cc(NC(=O)Nc2ccc(OCCN3CCOCC3)c3ccccc23)n(n1)-c1cccc(N)c1
: