Target
Dual specificity mitogen-activated protein kinase kinase 1
Ligand
BDBM50014412
Substrate
Meas. Tech.
ChEMBL_1350728 (CHEMBL3266113)
IC50
1.8±n/a nM
Citation
 Lu, HTu, WFei, HXu, GHu, QZhang, LLin, BYuan, JYin, JGong, AWan, MWang, DZhu, XFeng, JWang, QSun, P Structure-based design and synthesis of bicyclic fused-pyridines as MEK inhibitors. Bioorg Med Chem Lett 24:2555-9 (2014)  
Target
Name:
Dual specificity mitogen-activated protein kinase kinase 1
Synonyms:
Dual specificity mitogen-activated protein kinase (MEK) Dual specificity mitogen-activated protein kinase kinase 1 (MEK1) Dual specificity mitogen-activated protein kinase kinase MEK1/2 MAP kinase kinase 1 MAPK/ERK kinase 1 MEK-1 MP2K1_HUMAN PRKMK1 | VHL-MAP2K1/MAP2K2
Type:
Other Protein Type
Mol. Mass.:
43439.03
Organism:
Homo sapiens (Human)
Description:
Full-length human MEK-1 was generated by PCR and purified as a fusion protein from Escherichia coli lysates.
Residue:
393
  
Inhibitor
Name:
BDBM50014412
Synonyms:
Pimasertib US11701360, Pimasertib
Type:
Small organic molecule
Emp. Form.:
C15H15FIN3O3
Mol. Mass.:
431.2008
SMILES:
[H][C@@](O)(CO)CNC(=O)c1ccncc1Nc1ccc(I)cc1F
: