Target
5-hydroxytryptamine receptor 3A
Ligand
BDBM50014554
Substrate
Meas. Tech.
ChEMBL_1350972 (CHEMBL3268501)
EC50
178±n/a nM
Citation
 Manning, DDGuo, CZhang, ZRyan, KNNaginskaya, JChoo, SHMasih, LEarley, WGWierschke, JDNewman, ASBrady, CABarnes, NMGuzzo, PR The discovery of diazepinone-based 5-HT3 receptor partial agonists. Bioorg Med Chem Lett 24:2578-81 (2014)  
Target
Name:
5-hydroxytryptamine receptor 3A
Synonyms:
5-HT-3 5-HT3A 5-HT3R 5-hydroxytryptamine receptor 3A 5ht3 Htr3a Serotonin 3a (5-HT3a) receptor Serotonin-gated ion channel receptor
Type:
Mol. Mass.:
56056.00
Organism:
Mus musculus (house mouse)
Description:
5HT3A
Residue:
487
  
Inhibitor
Name:
BDBM50014554
Synonyms:
CHEMBL3261485
Type:
Small organic molecule
Emp. Form.:
C18H22N4O2
Mol. Mass.:
326.3929
SMILES:
COc1cc2C(=O)N(CCn3ncc(c1)c23)[C@@H]1CN2CCC1CC2
: