Target
Cytochrome P450 2C19
Ligand
BDBM50014551
Substrate
Meas. Tech.
ChEMBL_1350976 (CHEMBL3268875)
IC50
>50000±n/a nM
Citation
 Manning, DDGuo, CZhang, ZRyan, KNNaginskaya, JChoo, SHMasih, LEarley, WGWierschke, JDNewman, ASBrady, CABarnes, NMGuzzo, PR The discovery of diazepinone-based 5-HT3 receptor partial agonists. Bioorg Med Chem Lett 24:2578-81 (2014)  
Target
Name:
Cytochrome P450 2C19
Synonyms:
CP2CJ_HUMAN CYPIIC17 Cytochrome P450 2C19 (CYP2C19) Mephenytoin 4-hydroxylase P450-254C
Type:
Enzyme
Mol. Mass.:
55935.47
Organism:
Homo sapiens (Human)
Description:
P33261
Residue:
490
  
Inhibitor
Name:
BDBM50014551
Synonyms:
CHEMBL3261482
Type:
Small organic molecule
Emp. Form.:
C17H19FN4O
Mol. Mass.:
314.3574
SMILES:
Fc1cc2C(=O)N(CCn3ncc(c1)c23)[C@@H]1CN2CCC1CC2
: