Target
Cytochrome P450 3A4
Ligand
BDBM50014551
Substrate
Meas. Tech.
ChEMBL_1350978 (CHEMBL3268877)
IC50
>50000±n/a nM
Citation
 Manning, DDGuo, CZhang, ZRyan, KNNaginskaya, JChoo, SHMasih, LEarley, WGWierschke, JDNewman, ASBrady, CABarnes, NMGuzzo, PR The discovery of diazepinone-based 5-HT3 receptor partial agonists. Bioorg Med Chem Lett 24:2578-81 (2014)  
Target
Name:
Cytochrome P450 3A4
Synonyms:
Albendazole monooxygenase CP3A4_HUMAN CYP3A4 CYPIIIA4 Cytochrome P450 3A4 (CYP3A4) Nifedipine oxidase Taurochenodeoxycholate 6-alpha-hydroxylase
Type:
Enzyme
Mol. Mass.:
57349.57
Organism:
Homo sapiens (Human)
Description:
Residue:
503
  
Inhibitor
Name:
BDBM50014551
Synonyms:
CHEMBL3261482
Type:
Small organic molecule
Emp. Form.:
C17H19FN4O
Mol. Mass.:
314.3574
SMILES:
Fc1cc2C(=O)N(CCn3ncc(c1)c23)[C@@H]1CN2CCC1CC2
: