Target
Arylamine N-acetyltransferase 1
Ligand
BDBM50014928
Substrate
Meas. Tech.
ChEMBL_1347886 (CHEMBL3267122)
IC50
8400±n/a nM
Citation
 Egleton, JEThinnes, CCSeden, PTLaurieri, NLee, SPHadavizadeh, KSMeasures, ARJones, AMThompson, SVarney, AWynne, GMRyan, ASim, ERussell, AJ Structure-activity relationships and colorimetric properties of specific probes for the putative cancer biomarker human arylamine N-acetyltransferase 1. Bioorg Med Chem 22:3030-54 (2014)  
Target
Name:
Arylamine N-acetyltransferase 1
Synonyms:
AAC1 NAT1
Type:
PROTEIN
Mol. Mass.:
33898.32
Organism:
Homo sapiens (Human)
Description:
ChEMBL_1347886
Residue:
290
  
Inhibitor
Name:
BDBM50014928
Synonyms:
CHEMBL3262059
Type:
Small organic molecule
Emp. Form.:
C23H15NO5S
Mol. Mass.:
417.434
SMILES:
O=Cc1cccc(c1)C1=C(NS(=O)(=O)c2ccccc2)C(=O)c2ccccc2C1=O
: