Target
Arylamine N-acetyltransferase 1
Ligand
BDBM50014937
Substrate
Meas. Tech.
ChEMBL_1347886 (CHEMBL3267122)
IC50
19300±n/a nM
Citation
 Egleton, JEThinnes, CCSeden, PTLaurieri, NLee, SPHadavizadeh, KSMeasures, ARJones, AMThompson, SVarney, AWynne, GMRyan, ASim, ERussell, AJ Structure-activity relationships and colorimetric properties of specific probes for the putative cancer biomarker human arylamine N-acetyltransferase 1. Bioorg Med Chem 22:3030-54 (2014)  
Target
Name:
Arylamine N-acetyltransferase 1
Synonyms:
AAC1 NAT1
Type:
PROTEIN
Mol. Mass.:
33898.32
Organism:
Homo sapiens (Human)
Description:
ChEMBL_1347886
Residue:
290
  
Inhibitor
Name:
BDBM50014937
Synonyms:
CHEMBL3262076
Type:
Small organic molecule
Emp. Form.:
C22H15NO4
Mol. Mass.:
357.3588
SMILES:
O=C(Cc1ccccc1)NC1=C(c2ccoc2)C(=O)c2ccccc2C1=O
: