Target
Arylamine N-acetyltransferase 2
Ligand
BDBM50014912
Substrate
Meas. Tech.
ChEMBL_1347887 (CHEMBL3267123)
IC50
1900±n/a nM
Citation
 Egleton, JEThinnes, CCSeden, PTLaurieri, NLee, SPHadavizadeh, KSMeasures, ARJones, AMThompson, SVarney, AWynne, GMRyan, ASim, ERussell, AJ Structure-activity relationships and colorimetric properties of specific probes for the putative cancer biomarker human arylamine N-acetyltransferase 1. Bioorg Med Chem 22:3030-54 (2014)  
Target
Name:
Arylamine N-acetyltransferase 2
Synonyms:
ARY2_MOUSE Nat2
Type:
PROTEIN
Mol. Mass.:
33697.98
Organism:
Mus musculus
Description:
ChEMBL_1347887
Residue:
290
  
Inhibitor
Name:
BDBM50014912
Synonyms:
CHEMBL1568345
Type:
Small organic molecule
Emp. Form.:
C22H16N2O4S
Mol. Mass.:
404.438
SMILES:
O=C1C(Nc2ccccc2)=C(NS(=O)(=O)c2ccccc2)C(=O)c2ccccc12
: