Target
Arylamine N-acetyltransferase 2
Ligand
BDBM50014929
Substrate
Meas. Tech.
ChEMBL_1347887 (CHEMBL3267123)
IC50
6900±n/a nM
Citation
 Egleton, JEThinnes, CCSeden, PTLaurieri, NLee, SPHadavizadeh, KSMeasures, ARJones, AMThompson, SVarney, AWynne, GMRyan, ASim, ERussell, AJ Structure-activity relationships and colorimetric properties of specific probes for the putative cancer biomarker human arylamine N-acetyltransferase 1. Bioorg Med Chem 22:3030-54 (2014)  
Target
Name:
Arylamine N-acetyltransferase 2
Synonyms:
ARY2_MOUSE Nat2
Type:
PROTEIN
Mol. Mass.:
33697.98
Organism:
Mus musculus
Description:
ChEMBL_1347887
Residue:
290
  
Inhibitor
Name:
BDBM50014929
Synonyms:
CHEMBL3262060
Type:
Small organic molecule
Emp. Form.:
C23H15NO5S
Mol. Mass.:
417.434
SMILES:
O=Cc1ccc(cc1)C1=C(NS(=O)(=O)c2ccccc2)C(=O)c2ccccc2C1=O
: