Target
Arylamine N-acetyltransferase 2
Ligand
BDBM50014943
Substrate
Meas. Tech.
ChEMBL_1347887 (CHEMBL3267123)
IC50
2500±n/a nM
Citation
 Egleton, JEThinnes, CCSeden, PTLaurieri, NLee, SPHadavizadeh, KSMeasures, ARJones, AMThompson, SVarney, AWynne, GMRyan, ASim, ERussell, AJ Structure-activity relationships and colorimetric properties of specific probes for the putative cancer biomarker human arylamine N-acetyltransferase 1. Bioorg Med Chem 22:3030-54 (2014)  
Target
Name:
Arylamine N-acetyltransferase 2
Synonyms:
ARY2_MOUSE Nat2
Type:
PROTEIN
Mol. Mass.:
33697.98
Organism:
Mus musculus
Description:
ChEMBL_1347887
Residue:
290
  
Inhibitor
Name:
BDBM50014943
Synonyms:
CHEMBL3262084
Type:
Small organic molecule
Emp. Form.:
C24H21N3O4S
Mol. Mass.:
447.506
SMILES:
Cc1cc(C)cc(NC2=C(NS(=O)(=O)c3ccccc3)C(=O)c3cc(N)ccc3C2=O)c1
: