Target
Activin receptor type-1B
Ligand
BDBM50015639
Substrate
Meas. Tech.
ChEMBL_1349305 (CHEMBL3269163)
IC50
13±n/a nM
Citation
 Jin, CHKrishnaiah, MSreenu, DSubrahmanyam, VBRao, KSLee, HJPark, SJPark, HJLee, KSheen, YYKim, DK Discovery of N-((4-([1,2,4]triazolo[1,5-a]pyridin-6-yl)-5-(6-methylpyridin-2-yl)-1H-imidazol-2-yl)methyl)-2-fluoroaniline (EW-7197): a highly potent, selective, and orally bioavailable inhibitor of TGF-ß type I receptor kinase as cancer immunotherapeutic/antifibrotic agent. J Med Chem 57:4213-38 (2014)  
Target
Name:
Activin receptor type-1B
Synonyms:
ACV1B_HUMAN ACVRLK4 Activin receptor type-1B/Activin receptor-like kinase 4 (ALK-4)
Type:
PROTEIN
Mol. Mass.:
56810.99
Organism:
Homo sapiens (Human)
Description:
ChEMBL_587064
Residue:
505
  
Inhibitor
Name:
BDBM50015639
Synonyms:
CHEMBL3260567 | USRE47141, Example 2
Type:
Small organic molecule
Emp. Form.:
C22H18FN7
Mol. Mass.:
399.4236
SMILES:
Cc1cccc(n1)-c1[nH]c(CNc2ccccc2F)nc1-c1ccc2ncnn2c1
: