Target
Carbonic anhydrase 1
Ligand
BDBM50427222
Substrate
Meas. Tech.
ChEMBL_1349989 (CHEMBL3270415)
Ki
69±n/a nM
Citation
 Nishimori, IVullo, DMinakuchi, TScozzafava, ACapasso, CSupuran, CT Sulfonamide inhibition studies of twoß-carbonic anhydrases from the bacterial pathogen Legionella pneumophila. Bioorg Med Chem 22:2939-46 (2014)  
Target
Name:
Carbonic anhydrase 1
Synonyms:
CA-I CAB Carbonate dehydratase I Carbonic anhydrase 1 (CA I) Carbonic anhydrase 1 (Recombinant CA I) Carbonic anhydrase B Carbonic anhydrase I (CA I) Carbonic anhydrase I (CAI) Carbonic anhydrase isoenzyme I (hCA I) | hCA
Type:
Enzyme
Mol. Mass.:
28873.37
Organism:
Homo sapiens (Human)
Description:
P00915
Residue:
261
  
Inhibitor
Name:
BDBM50427222
Synonyms:
CHEMBL2324864
Type:
Small organic molecule
Emp. Form.:
C15H17N3O7S2
Mol. Mass.:
415.441
SMILES:
NS(=O)(=O)c1ccc(CCNS(=O)(=O)c2ccc(cc2CO)[N+]([O-])=O)cc1
: