Target
D(3) dopamine receptor
Ligand
BDBM50016462
Substrate
Meas. Tech.
ChEMBL_1347652 (CHEMBL3270691)
Ki
2.8±n/a nM
Citation
 Chen, JLevant, BJiang, CKeck, TMNewman, AHWang, S Tranylcypromine substituted cis-hydroxycyclobutylnaphthamides as potent and selective dopamine D3 receptor antagonists. J Med Chem 57:4962-8 (2014)  
Target
Name:
D(3) dopamine receptor
Synonyms:
DOPAMINE D3 DRD3_HUMAN Dopamine D3 receptor (D3) Dopamine receptor Dopamine receptor D3
Type:
Mol. Mass.:
44243.43
Organism:
Homo sapiens (Human)
Description:
Residue:
400
  
Inhibitor
Name:
BDBM50016462
Synonyms:
CHEMBL3265067
Type:
Small organic molecule
Emp. Form.:
C29H33ClN2O2
Mol. Mass.:
477.038
SMILES:
CCCN(CC[C@@]1(O)C[C@@H](C1)NC(=O)c1ccc2ccccc2c1)[C@@H]1C[C@H]1c1ccc(Cl)cc1
: