Target
D(3) dopamine receptor
Ligand
BDBM50400512
Substrate
Meas. Tech.
ChEMBL_1347647 (CHEMBL3270686)
Ki
0.400000±n/a nM
Citation
 Chen, JLevant, BJiang, CKeck, TMNewman, AHWang, S Tranylcypromine substituted cis-hydroxycyclobutylnaphthamides as potent and selective dopamine D3 receptor antagonists. J Med Chem 57:4962-8 (2014)  
Target
Name:
D(3) dopamine receptor
Synonyms:
DOPAMINE D3 Dopamine D3 receptor | Drd3
Type:
Protein
Mol. Mass.:
49540.58
Organism:
Rattus norvegicus (Rat)
Description:
P19020
Residue:
446
  
Inhibitor
Name:
BDBM50400512
Synonyms:
CHEMBL2203405
Type:
Small organic molecule
Emp. Form.:
C27H34N4O2S
Mol. Mass.:
478.649
SMILES:
CCCN(CC[C@@]1(O)C[C@@H](C1)NC(=O)c1ccc2ccccc2c1)[C@H]1CCc2nc(N)sc2C1
: