Target
D(2) dopamine receptor
Ligand
BDBM50005118
Substrate
Meas. Tech.
ChEMBL_1347653 (CHEMBL3270692)
Ki
13±n/a nM
Citation
 Chen, JLevant, BJiang, CKeck, TMNewman, AHWang, S Tranylcypromine substituted cis-hydroxycyclobutylnaphthamides as potent and selective dopamine D3 receptor antagonists. J Med Chem 57:4962-8 (2014)  
Target
Name:
D(2) dopamine receptor
Synonyms:
D(2) dopamine receptor DOPAMINE D2 Long DRD2 Dopamine D2 receptor Dopamine D2 receptor (D2R) Dopamine2-like | d2
Type:
Cell-surface receptors
Mol. Mass.:
50647.10
Organism:
Homo sapiens (Human)
Description:
P14416
Residue:
443
  
Inhibitor
Name:
BDBM50005118
Synonyms:
(S)-3,5-Dichloro-N-(1-ethyl-pyrrolidin-2-ylmethyl)-2-hydroxy-6-methoxy-benzamide (S)3,5-Dichloro-N-(1-ethyl-pyrrolidin-2-ylmethyl)-2-hydroxy-6-methoxy-benzamide 3,5-Dichloro-N-(1-ethyl-pyrrolidin-2-ylmethyl)-2-hydroxy-6-methoxy-benzamide 3,5-Dichloro-N-(1-ethyl-pyrrolidin-2-ylmethyl)-2-hydroxy-6-methoxy-benzamide(Raclopride) RACLOPRIDE | Raclopride;3,5-Dichloro-N-(1-ethyl-pyrrolidin-2-ylmethyl)-2-hydroxy-6-methoxy-benzamide
Type:
Small organic molecule
Emp. Form.:
C15H20Cl2N2O3
Mol. Mass.:
347.237
SMILES:
CCN1CCC[C@H]1CNC(=O)c1c(O)c(Cl)cc(Cl)c1OC
: