Target
Prothrombin
Ligand
BDBM50010135
Substrate
Meas. Tech.
ChEMBL_1354674 (CHEMBL3281099)
Ki
1200±n/a nM
Citation
 Geratz, JDCheng, MCTidwell, RR Novel bis(benzamidino) compounds with an aromatic central link. Inhibitors of thrombin, pancreatic kallikrein, trypsin, and complement. J Med Chem 19:634-9 (1976)  
Target
Name:
Prothrombin
Synonyms:
Activation peptide fragment 1 Coagulation factor II Prothrombin Thrombin Thrombin light chain
Type:
Enzyme
Mol. Mass.:
70502.73
Organism:
Bos taurus (Bovine)
Description:
P00735
Residue:
625
  
Inhibitor
Name:
BDBM50010135
Synonyms:
CHEMBL548400
Type:
Small organic molecule
Emp. Form.:
C22H20I2N4O2
Mol. Mass.:
626.2287
SMILES:
NC(=N)c1ccc(OCc2cccc(COc3ccc(cc3I)C(N)=N)c2)c(I)c1
: