Target
Prothrombin
Ligand
BDBM50016530
Substrate
Meas. Tech.
ChEMBL_1354674 (CHEMBL3281099)
Ki
2900±n/a nM
Citation
 Geratz, JDCheng, MCTidwell, RR Novel bis(benzamidino) compounds with an aromatic central link. Inhibitors of thrombin, pancreatic kallikrein, trypsin, and complement. J Med Chem 19:634-9 (1976)  
Target
Name:
Prothrombin
Synonyms:
Activation peptide fragment 1 Coagulation factor II Prothrombin Thrombin Thrombin light chain
Type:
Enzyme
Mol. Mass.:
70502.73
Organism:
Bos taurus (Bovine)
Description:
P00735
Residue:
625
  
Inhibitor
Name:
BDBM50016530
Synonyms:
CHEMBL3277927
Type:
Small organic molecule
Emp. Form.:
C26H25ClN4O2
Mol. Mass.:
460.955
SMILES:
Cl.NC(=N)c1cccc(COc2cccc3c(OCc4cccc(c4)C(N)=N)cccc23)c1
: