Target
Prothrombin
Ligand
BDBM50016536
Substrate
Meas. Tech.
ChEMBL_1354674 (CHEMBL3281099)
Ki
4900±n/a nM
Citation
 Geratz, JDCheng, MCTidwell, RR Novel bis(benzamidino) compounds with an aromatic central link. Inhibitors of thrombin, pancreatic kallikrein, trypsin, and complement. J Med Chem 19:634-9 (1976)  
Target
Name:
Prothrombin
Synonyms:
Activation peptide fragment 1 Coagulation factor II Prothrombin Thrombin Thrombin light chain
Type:
Enzyme
Mol. Mass.:
70502.73
Organism:
Bos taurus (Bovine)
Description:
P00735
Residue:
625
  
Inhibitor
Name:
BDBM50016536
Synonyms:
CHEMBL3277931
Type:
Small organic molecule
Emp. Form.:
C26H25ClN4O2
Mol. Mass.:
460.955
SMILES:
Cl.NC(=N)c1ccc(COc2ccc3ccc(OCc4ccc(cc4)C(N)=N)cc3c2)cc1
: