Target
Dihydrofolate reductase
Ligand
BDBM50016789
Substrate
Meas. Tech.
ChEMBL_1357878 (CHEMBL3285765)
IC50
20±n/a nM
Citation
 Chaykovsky, MHirst, MLazarus, HMartinelli, JE Methotrexate analogues. 9. Synthesis and biological properties of some 8-alkyl-7,8-dihydro analogues. J Med Chem 20:1323-7 (1977)  
Target
Name:
Dihydrofolate reductase
Synonyms:
DYR_LACCA folA
Type:
PROTEIN
Mol. Mass.:
18437.08
Organism:
Lactobacillus casei
Description:
ChEMBL_1357878
Residue:
163
  
Inhibitor
Name:
BDBM50016789
Synonyms:
CHEMBL3273846
Type:
Small organic molecule
Emp. Form.:
C20H24N8O5
Mol. Mass.:
456.4552
SMILES:
CN(CC1=Nc2c(N)nc(N)nc2NC1)c1ccc(cc1)C(=O)N[C@@H](CCC(O)=O)C(O)=O
: