Target
Thymidylate synthase
Ligand
BDBM50016802
Substrate
Meas. Tech.
ChEMBL_1357879 (CHEMBL3285766)
IC50
20000±n/a nM
Citation
 Chaykovsky, MHirst, MLazarus, HMartinelli, JE Methotrexate analogues. 9. Synthesis and biological properties of some 8-alkyl-7,8-dihydro analogues. J Med Chem 20:1323-7 (1977)  
Target
Name:
Thymidylate synthase
Synonyms:
TSase Thymidylate Synthase (TS) thyA
Type:
Enzyme
Mol. Mass.:
36576.54
Organism:
Lactobacillus casei
Description:
Residue:
316
  
Inhibitor
Name:
BDBM50016802
Synonyms:
CHEMBL3273848
Type:
Small organic molecule
Emp. Form.:
C22H28N8O5
Mol. Mass.:
484.5083
SMILES:
CCN1CC(CN(C)c2ccc(cc2)C(=O)N[C@@H](CCC(O)=O)C(O)=O)=Nc2c(N)nc(N)nc12
: