Target
Prostaglandin E2 receptor EP2 subtype
Ligand
BDBM50016953
Substrate
Meas. Tech.
ChEMBL_1364371 (CHEMBL3294240)
Ki
10.0±n/a nM
Citation
 Ganesh, T Prostanoid receptor EP2 as a therapeutic target. J Med Chem 57:4454-65 (2014)  
Target
Name:
Prostaglandin E2 receptor EP2 subtype
Synonyms:
PE2R2_HUMAN PTGER2 Prostaglandin E2 receptor Prostanoid EP2 Receptor
Type:
Enzyme
Mol. Mass.:
39775.71
Organism:
Homo sapiens (Human)
Description:
P43116
Residue:
358
  
Inhibitor
Name:
BDBM50016953
Synonyms:
Taprenepag
Type:
Small organic molecule
Emp. Form.:
C24H22N4O5S
Mol. Mass.:
478.52
SMILES:
OC(=O)COc1cccc(CN(Cc2ccc(cc2)-n2cccn2)S(=O)(=O)c2cccnc2)c1
: