Target
11-beta-hydroxysteroid dehydrogenase 1
Ligand
BDBM50384522
Substrate
Meas. Tech.
ChEMBL_1364745 (CHEMBL3294006)
IC50
2.0±n/a nM
Citation
 Scott, JSGoldberg, FWTurnbull, AV Medicinal chemistry of inhibitors of 11ß-hydroxysteroid dehydrogenase type 1 (11ß-HSD1). J Med Chem 57:4466-86 (2014)  
Target
Name:
11-beta-hydroxysteroid dehydrogenase 1
Synonyms:
11-DH 11-beta-Hydroxysteroid Dehydrogenase 1 (11-beta-HSD1) 11beta-HSD1A Corticosteroid 11-beta-dehydrogenase isozyme 1 (11-beta-HSD-1) Hsd11 | Hsd11b1
Type:
Enzyme
Mol. Mass.:
32369.70
Organism:
Mus musculus (mouse)
Description:
P50172
Residue:
292
  
Inhibitor
Name:
BDBM50384522
Synonyms:
CHEMBL2036234
Type:
Small organic molecule
Emp. Form.:
C23H29Cl3N4O4S
Mol. Mass.:
563.925
SMILES:
CC1CN(CC(=O)N[C@H]2C3CC4CC2C[C@](C4)(C3)C(N)=O)S(=O)(=O)N(C1)c1c(Cl)cc(Cl)cc1Cl
: