Target
11-beta-hydroxysteroid dehydrogenase 1
Ligand
BDBM50017007
Substrate
Meas. Tech.
ChEMBL_1364746 (CHEMBL3294007)
IC50
1.2±n/a nM
Citation
 Scott, JSGoldberg, FWTurnbull, AV Medicinal chemistry of inhibitors of 11ß-hydroxysteroid dehydrogenase type 1 (11ß-HSD1). J Med Chem 57:4466-86 (2014)  
Target
Name:
11-beta-hydroxysteroid dehydrogenase 1
Synonyms:
11-DH 11-beta-Hydroxysteroid Dehydrogenase 1 (11-beta-HSD1) 11-beta-hydroxysteroid dehydrogenase 1 (11HSD1) Corticosteroid 11-beta-dehydrogenase isozyme 1 (11-beta-HSD-1) Corticosteroid 11-beta-dehydrogenase isozyme 1 (11beta-HSD1) HSD11 HSD11L | SDR26C1
Type:
Enzyme
Mol. Mass.:
32409.16
Organism:
Homo sapiens (Human)
Description:
P28845
Residue:
292
  
Inhibitor
Name:
BDBM50017007
Synonyms:
CHEMBL3287026
Type:
Small organic molecule
Emp. Form.:
C23H31ClN2O4S
Mol. Mass.:
467.021
SMILES:
Cc1c(Cl)cccc1S(=O)(=O)N1CCCC[C@@H]1C(=O)N[C@H]1C2CC3CC1C[C@](O)(C3)C2
: