Target
Metabotropic glutamate receptor 2
Ligand
BDBM50017664
Substrate
Meas. Tech.
ChEMBL_1364012 (CHEMBL3295851)
IC50
>10000±n/a nM
Citation
 Wenthur, CJMorrison, RDDaniels, JSConn, PJLindsley, CW Synthesis and SAR of substituted pyrazolo[1,5-a]quinazolines as dual mGlu(2)/mGlu(3) NAMs. Bioorg Med Chem Lett 24:2693-8 (2014)  
Target
Name:
Metabotropic glutamate receptor 2
Synonyms:
GPRC1B GRM2_HUMAN Metabotropic glutamate receptor mGlu2 | metabotropic glutamate 2
Type:
Enzyme
Mol. Mass.:
95584.88
Organism:
Homo sapiens (Human)
Description:
Q14416
Residue:
872
  
Inhibitor
Name:
BDBM50017664
Synonyms:
CHEMBL3288678
Type:
Small organic molecule
Emp. Form.:
C24H17N5O
Mol. Mass.:
391.4247
SMILES:
Cn1c2cc(nn2c2cc(ccc2c1=O)-c1ccc2cn[nH]c2c1)-c1ccccc1
: