Target
Kinesin-like protein KIF11
Ligand
BDBM50347614
Substrate
Meas. Tech.
ChEMBL_1364398 (CHEMBL3294267)
IC50
120±n/a nM
Citation
 Takeuchi, TOishi, SKaneda, MMisu, ROhno, HSawada, JAsai, ANakamura, SNakanishi, IFujii, N Optimization of diaryl amine derivatives as kinesin spindle protein inhibitors. Bioorg Med Chem 22:3171-9 (2014)  
Target
Name:
Kinesin-like protein KIF11
Synonyms:
EG5 KIF11_HUMAN Kinesin Spindle Protein Eg5 TRIP5 | kinesin spindle protein
Type:
PROTEIN
Mol. Mass.:
119138.97
Organism:
Homo sapiens (Human)
Description:
ChEMBL_1457426
Residue:
1056
  
Inhibitor
Name:
BDBM50347614
Synonyms:
CHEMBL1803018
Type:
Small organic molecule
Emp. Form.:
C14H10F3N3O
Mol. Mass.:
293.2439
SMILES:
NC(=O)Nc1ccc2[nH]c3cc(ccc3c2c1)C(F)(F)F
: