Target
Dihydroorotate dehydrogenase (quinone), mitochondrial
Ligand
BDBM50018011
Substrate
Meas. Tech.
ChEMBL_1366447 (CHEMBL3296347)
IC50
440±n/a nM
Citation
 Deng, XKokkonda, SEl Mazouni, FWhite, JBurrows, JNKaminsky, WCharman, SAMatthews, DRathod, PKPhillips, MA Fluorine modulates species selectivity in the triazolopyrimidine class of Plasmodium falciparum dihydroorotate dehydrogenase inhibitors. J Med Chem 57:5381-94 (2014)  
Target
Name:
Dihydroorotate dehydrogenase (quinone), mitochondrial
Synonyms:
DHODH Dihydroorotate dehydrogenase Dihydroorotate dehydrogenase, mitochondrial Dihydroorotate oxidase (DHODH) | PYRD_HUMAN
Type:
Enzyme
Mol. Mass.:
42881.33
Organism:
Homo sapiens (Human)
Description:
Q02127
Residue:
395
  
Inhibitor
Name:
BDBM50018011
Synonyms:
Aubagio HMR-1726 | TERIFLUNOMIDE
Type:
Small organic molecule
Emp. Form.:
C12H9F3N2O2
Mol. Mass.:
270.2073
SMILES:
C\C(O)=C(/C#N)C(=O)Nc1ccc(cc1)C(F)(F)F
: