Target
D(2) dopamine receptor
Ligand
BDBM50018240
Substrate
Meas. Tech.
ChEMBL_1366809 (CHEMBL3297244)
Ki
1.000000±n/a nM
Citation
 Kolaczkowski, MMarcinkowska, MBucki, APawlowski, MMitka, KJaskowska, JKowalski, PKazek, GSiwek, AWasik, AWesolowska, AMierzejewski, PBienkowski, P Novel arylsulfonamide derivatives with 5-HT6/5-HT7 receptor antagonism targeting behavioral and psychological symptoms of dementia. J Med Chem 57:4543-57 (2014)  
Target
Name:
D(2) dopamine receptor
Synonyms:
D(2) dopamine receptor DOPAMINE D2 Long DRD2 Dopamine D2 receptor Dopamine D2 receptor (D2R) Dopamine2-like | d2
Type:
Cell-surface receptors
Mol. Mass.:
50647.10
Organism:
Homo sapiens (Human)
Description:
P14416
Residue:
443
  
Inhibitor
Name:
BDBM50018240
Synonyms:
CHEMBL3290005
Type:
Small organic molecule
Emp. Form.:
C25H26FN3O3S
Mol. Mass.:
467.556
SMILES:
Fc1ccc2c(noc2c1)C1CCN(CCCNS(=O)(=O)c2ccc3ccccc3c2)CC1
: