Target
Acetylcholinesterase
Ligand
BDBM50018671
Substrate
Meas. Tech.
ChEMBL_1362459 (CHEMBL3292815)
Ki
1210±n/a nM
Citation
 Wang, LEsteban, GOjima, MBautista-Aguilera, OMInokuchi, TMoraleda, IIriepa, ISamadi, AYoudim, MBRomero, ASoriano, EHerrero, RFernández Fernández, APRicardo-Martínez-Murillo, naMarco-Contelles, JUnzeta, M Donepezil + propargylamine + 8-hydroxyquinoline hybrids as new multifunctional metal-chelators, ChE and MAO inhibitors for the potential treatment of Alzheimer's disease. Eur J Med Chem 80:543-61 (2014)  
Target
Name:
Acetylcholinesterase
Synonyms:
ACES_ELEEL Acetylcholinesterase (EeAChE) | ache
Type:
Enzyme
Mol. Mass.:
71812.79
Organism:
Electrophorus electricus (Electric eel)
Description:
Residue:
633
  
Inhibitor
Name:
BDBM50018671
Synonyms:
CHEMBL3291019
Type:
Small organic molecule
Emp. Form.:
C29H32N4O
Mol. Mass.:
452.5906
SMILES:
Oc1ccc(CN(CC#C)C(CCC2CCN(Cc3ccccc3)CC2)C#N)c2cccnc12
: