Target
Adenosine receptor A2a
Ligand
BDBM50018695
Substrate
Meas. Tech.
ChEMBL_1362844 (CHEMBL3295794)
IC50
0.500000±n/a nM
Citation
 Endo, KDeguchi, KMatsunaga, HTomaya, KYamada, K 8-Substituted 2-alkynyl-N(9)-propargyladenines as A2A adenosine receptor antagonists. Bioorg Med Chem 22:3072-82 (2014)  
Target
Name:
Adenosine receptor A2a
Synonyms:
AA2AR_RAT Adenosine A2 receptor Adenosine Receptors A2a (A2a) Adenosine receptors A2a Rat striatal adenosine A2a receptor
Type:
G Protein-Coupled Receptor (GPCR)
Mol. Mass.:
45015.65
Organism:
Rattus norvegicus (rat)
Description:
Rat A2A receptors expressed in CHO cells.
Residue:
410
  
Inhibitor
Name:
BDBM50018695
Synonyms:
CHEMBL3291308
Type:
Small organic molecule
Emp. Form.:
C16H16BrN5O
Mol. Mass.:
374.235
SMILES:
Nc1nc(nc2n(CC#C)c(Br)nc12)C#CC1(O)CCCCC1
: