Target
ALK tyrosine kinase receptor
Ligand
BDBM50018822
Substrate
Meas. Tech.
ChEMBL_1363644 (CHEMBL3293162)
Ki
8.2±n/a nM
Citation
 Johnson, TWRichardson, PFBailey, SBrooun, ABurke, BJCollins, MRCui, JJDeal, JGDeng, YLDinh, DEngstrom, LDHe, MHoffman, JHoffman, RLHuang, QKania, RSKath, JCLam, HLam, JLLe, PTLingardo, LLiu, WMcTigue, MPalmer, CLSach, NWSmeal, TSmith, GLStewart, AETimofeevski, SZhu, HZhu, JZou, HYEdwards, MP Discovery of (10R)-7-amino-12-fluoro-2,10,16-trimethyl-15-oxo-10,15,16,17-tetrahydro-2H-8,4-(metheno)pyrazolo[4,3-h][2,5,11]-benzoxadiazacyclotetradecine-3-carbonitrile (PF-06463922), a macrocyclic inhibitor of anaplastic lymphoma kinase (ALK) and c-ros oncogene 1 (ROS1) with preclinical brain expo J Med Chem 57:4720-44 (2014)  
Target
Name:
ALK tyrosine kinase receptor
Synonyms:
ALK ALK_HUMAN CD_antigen: CD246
Type:
Protein
Mol. Mass.:
176453.10
Organism:
Homo sapiens (Human)
Description:
Q9UM73
Residue:
1620
  
Inhibitor
Name:
BDBM50018822
Synonyms:
CHEMBL3286812
Type:
Small organic molecule
Emp. Form.:
C20H20FN5O3
Mol. Mass.:
397.4029
SMILES:
CNC(=O)c1ccc(F)cc1[C@@H](C)Oc1nc(cnc1N)-c1cccnc1OC
: