Target
Tyrosine-protein kinase ITK/TSK
Ligand
BDBM50019899
Substrate
Meas. Tech.
ChEMBL_1361886 (CHEMBL3293061)
Ki
4000±n/a nM
Citation
 Abdel-Magid, AF Treatment of Immunological or Inflammatory Disorders with ITK Kinase Inhibitors. ACS Med Chem Lett 5:456-7 (2014)  
Target
Name:
Tyrosine-protein kinase ITK/TSK
Synonyms:
EMT ITK_HUMAN LYK Tyrosine-protein kinase ITK Tyrosine-protein kinase Lyk
Type:
Protein
Mol. Mass.:
71839.20
Organism:
Homo sapiens (Human)
Description:
Q08881
Residue:
620
  
Inhibitor
Name:
BDBM50019899
Synonyms:
CHEMBL3287198
Type:
Small organic molecule
Emp. Form.:
C22H24N6O2
Mol. Mass.:
404.465
SMILES:
CN1CCC2(CCc3c(C2)[nH]nc3C(=O)Nc2cnn(Cc3ccccc3)c2)C1=O
: