Target
Plasminogen
Ligand
BDBM50357211
Substrate
Meas. Tech.
ChEMBL_1363410 (CHEMBL3295545)
IC50
40000±n/a nM
Citation
 Cheng, LPettersen, DOhlsson, BSchell, PKarle, MEvertsson, EPahlén, SJonforsen, MPlowright, ATBoström, JFex, TThelin, AHilgendorf, CXue, YWahlund, GLindberg, WLarsson, LOGustafsson, D Discovery of the Fibrinolysis Inhibitor AZD6564, Acting via Interference of a Protein-Protein Interaction. ACS Med Chem Lett 5:538-43 (2014)  
Target
Name:
Plasminogen
Synonyms:
Activation peptide PLG Plasmin Plasmin heavy chain A, short form | Plasmin light chain B
Type:
Enzyme
Mol. Mass.:
90579.18
Organism:
Homo sapiens (Human)
Description:
Residue:
810
  
Inhibitor
Name:
BDBM50357211
Synonyms:
177 J.D. Amicar | Aminocaproic
Type:
Small organic molecule
Emp. Form.:
C6H13NO2
Mol. Mass.:
131.1729
SMILES:
NCCCCCC(O)=O
: