Target
Diacylglycerol O-acyltransferase 1
Ligand
BDBM50020054
Substrate
Meas. Tech.
ChEMBL_1363772 (CHEMBL3294189)
IC50
45±n/a nM
Citation
 Zhou, GZorn, NTing, PAslanian, RLin, MCook, JLachowicz, JLin, ASmith, MHwa, Jvan Heek, MWalker, S Development of novel benzomorpholine class of diacylglycerol acyltransferase I inhibitors. ACS Med Chem Lett 5:544-9 (2014)  
Target
Name:
Diacylglycerol O-acyltransferase 1
Synonyms:
DGAT1_MOUSE Dgat1 Diacylglycerol O-acyltransferase 1 (DGAT1) | Diglyceride acyltransferase
Type:
Enzyme
Mol. Mass.:
56810.61
Organism:
Mus musculus (mouse)
Description:
In this assay, recombinant mouse DGAT-1 containing an N-terminal His6-epitope tag was produced in the baculovirus expression system.
Residue:
498
  
Inhibitor
Name:
BDBM50020054
Synonyms:
CHEMBL3287890
Type:
Small organic molecule
Emp. Form.:
C29H30N2O4
Mol. Mass.:
470.5595
SMILES:
OC(=O)C[C@H]1CC[C@H](CC1)c1ccc(cc1)-c1ccc2N(CCOc2c1)C(=O)Nc1ccccc1
: