Target
Diacylglycerol O-acyltransferase 2
Ligand
BDBM50009432
Substrate
Meas. Tech.
ChEMBL_1363765 (CHEMBL3294182)
IC50
>10000±n/a nM
Citation
 Zhou, GZorn, NTing, PAslanian, RLin, MCook, JLachowicz, JLin, ASmith, MHwa, Jvan Heek, MWalker, S Development of novel benzomorpholine class of diacylglycerol acyltransferase I inhibitors. ACS Med Chem Lett 5:544-9 (2014)  
Target
Name:
Diacylglycerol O-acyltransferase 2
Synonyms:
ARAT DGAT2 Diacylglycerol O-acyltransferase 2 (DGAT2) Retinol O-fatty-acyltransferase
Type:
Multi-pass membrane protein
Mol. Mass.:
43848.90
Organism:
Homo sapiens (Human)
Description:
Q96PD7
Residue:
388
  
Inhibitor
Name:
BDBM50009432
Synonyms:
CHEMBL3233884
Type:
Small organic molecule
Emp. Form.:
C29H30N2O4
Mol. Mass.:
470.5595
SMILES:
OC(=O)C[C@H]1CC[C@@H](CC1)c1ccc(cc1)-c1ccc2N(CCOc2c1)C(=O)Nc1ccccc1
: