Target
Diacylglycerol O-acyltransferase 1
Ligand
BDBM50020081
Substrate
Meas. Tech.
ChEMBL_1363771 (CHEMBL3294188)
IC50
>10000±n/a nM
Citation
 Zhou, GZorn, NTing, PAslanian, RLin, MCook, JLachowicz, JLin, ASmith, MHwa, Jvan Heek, MWalker, S Development of novel benzomorpholine class of diacylglycerol acyltransferase I inhibitors. ACS Med Chem Lett 5:544-9 (2014)  
Target
Name:
Diacylglycerol O-acyltransferase 1
Synonyms:
ACAT-related gene product 1 Acyl coA-diacylglycerol acyl transferase 1 (DGAT1) DGAT1 Diacylglycerol Acyltransferase (DGAT1) Diacylglycerol O-acyltransferase 1 (DGAT1) | Diglyceride acyltransferase
Type:
Protein
Mol. Mass.:
55297.82
Organism:
Homo sapiens (Human)
Description:
O75907
Residue:
488
  
Inhibitor
Name:
BDBM50020081
Synonyms:
CHEMBL3287863
Type:
Small organic molecule
Emp. Form.:
C30H30N2O5
Mol. Mass.:
498.5696
SMILES:
CC1Oc2cc(ccc2N(C(=O)Nc2ccccc2)C1=O)-c1ccc(cc1)[C@H]1CC[C@H](CC(O)=O)CC1
: