Target
Protein-tyrosine kinase 2-beta
Ligand
BDBM50020310
Substrate
Meas. Tech.
ChEMBL_1365411 (CHEMBL3296770)
Ki
340±n/a nM
Citation
 Zhang, LZheng, QYang, YZhou, HGong, XZhao, SFan, C Synthesis and in vivo SAR study of indolin-2-one-based multi-targeted inhibitors as potential anticancer agents. Eur J Med Chem 82:139-51 (2014)  
Target
Name:
Protein-tyrosine kinase 2-beta
Synonyms:
FAK2 PTK2B PTK2B protein tyrosine kinase 2 beta (PTK2B) Protein tyrosine kinase 2 beta | RAFTK
Type:
Protein
Mol. Mass.:
115868.80
Organism:
Homo sapiens (Human)
Description:
Q14289
Residue:
1009
  
Inhibitor
Name:
BDBM50020310
Synonyms:
CHEMBL3288854
Type:
Small organic molecule
Emp. Form.:
C23H28FN5O2
Mol. Mass.:
425.4991
SMILES:
CN1CCN(CCC(=O)Nc2c(C)[nH]c(\C=C3/C(=O)Nc4ccc(F)cc34)c2C)CC1
: