Target
Somatostatin receptor type 3
Ligand
BDBM50021108
Substrate
Meas. Tech.
ChEMBL_1365873 (CHEMBL3296531)
Ki
48±n/a nM
Citation
 Li, DWu, ZYu, YBall, RGGuo, LSherer, EHe, SHong, QLai, ZQi, HTruong, QYang, DXChicchi, GGTsao, KLTrusca, DTrujillo, MPachanski, MEiermann, GJHoward, ADZhou, YPZhang, BBNargund, RPHagmann, WK Diamine Derivatives as Novel Small-Molecule, Potent, and Subtype-Selective Somatostatin SST3 Receptor Agonists. ACS Med Chem Lett 5:690-5 (2014)  
Target
Name:
Somatostatin receptor type 3
Synonyms:
SOMATOSTATIN SST3 SS3-R SSR-28 SSTR3 | Somatostatin receptor type 3 (SSTR3)
Type:
Protein
Mol. Mass.:
45855.97
Organism:
Homo sapiens (Human)
Description:
P32745
Residue:
418
  
Inhibitor
Name:
BDBM50021108
Synonyms:
CHEMBL3287626
Type:
Small organic molecule
Emp. Form.:
C21H24Cl2N2O2
Mol. Mass.:
407.333
SMILES:
COc1ccc(cc1)C(=O)N[C@@H]1CCCC[C@@H]1NCc1ccc(Cl)c(Cl)c1
: