Target
Proteasome subunit beta type-1
Ligand
BDBM50434763
Substrate
Meas. Tech.
ChEMBL_1366691 (CHEMBL3296842)
Ki
1550±n/a nM
Citation
 Troiano, VScarbaci, KEttari, RMicale, NCerchia, CPinto, ASchirmeister, TNovellino, EGrasso, SLavecchia, AZappalą, M Optimization of peptidomimetic boronates bearing a P3 bicyclic scaffold as proteasome inhibitors. Eur J Med Chem 83:1-14 (2014)  
Target
Name:
Proteasome subunit beta type-1
Synonyms:
PSB1_HUMAN PSMB1 Proteasome subunit beta type-1/beta type-5
Type:
PROTEIN
Mol. Mass.:
26493.62
Organism:
Homo sapiens (Human)
Description:
ChEMBL_1366691
Residue:
241
  
Inhibitor
Name:
BDBM50434763
Synonyms:
CHEMBL2385817
Type:
Small organic molecule
Emp. Form.:
C15H20BN3O4
Mol. Mass.:
317.148
SMILES:
CC(C)C[C@H](NC(=O)Cn1ccc2ncccc2c1=O)B(O)O
: