Target
Interleukin-2
Ligand
BDBM50409029
Substrate
Meas. Tech.
ChEMBL_1363478 (CHEMBL3291700)
Kd
3380±n/a nM
Citation
 Chen, LDu, JDai, QZhang, HPang, WHu, J Prediction of anti-tumor chemical probes of a traditional Chinese medicine formula by HPLC fingerprinting combined with molecular docking. Eur J Med Chem 83:294-306 (2014)  
Target
Name:
Interleukin-2
Synonyms:
IL-2 IL2_HUMAN Interleukin-2 T-cell growth factor | TCGF
Type:
Enzyme
Mol. Mass.:
17630.05
Organism:
Homo sapiens (Human)
Description:
P60568
Residue:
153
  
Inhibitor
Name:
BDBM50409029
Synonyms:
DAIDZIN
Type:
Small organic molecule
Emp. Form.:
C21H20O9
Mol. Mass.:
416.3781
SMILES:
OC[C@H]1O[C@@H](Oc2ccc3c(c2)occ(-c2ccc(O)cc2)c3=O)[C@H](O)[C@@H](O)[C@@H]1O
: