Target
Tyrosine-protein kinase JAK3
Ligand
BDBM50021655
Substrate
Meas. Tech.
ChEMBL_1368154 (CHEMBL3299202)
Ki
2.5±n/a nM
Citation
 Clark, JDFlanagan, METelliez, JB Discovery and development of Janus kinase (JAK) inhibitors for inflammatory diseases. J Med Chem 57:5023-38 (2014)  
Target
Name:
Tyrosine-protein kinase JAK3
Synonyms:
JAK-3 JAK3_HUMAN Janus kinase 3 (JAK3) L-JAK | Leukocyte janus kinase
Type:
Protein
Mol. Mass.:
125111.08
Organism:
Homo sapiens (Human)
Description:
P52333
Residue:
1124
  
Inhibitor
Name:
BDBM50021655
Synonyms:
DECERNOTINIB US10766894, Compound TABLE 1.2 VRT-831509 | VX-509
Type:
Small organic molecule
Emp. Form.:
C18H19F3N6O
Mol. Mass.:
392.3783
SMILES:
CC[C@@](C)(Nc1ccnc(n1)-c1c[nH]c2ncccc12)C(=O)NCC(F)(F)F
: