Target
Tyrosine-protein kinase JAK3
Ligand
BDBM50021655
Substrate
Meas. Tech.
ChEMBL_1368188 (CHEMBL3299324)
IC50
50±n/a nM
Citation
 Clark, JDFlanagan, METelliez, JB Discovery and development of Janus kinase (JAK) inhibitors for inflammatory diseases. J Med Chem 57:5023-38 (2014)  
Target
Name:
Tyrosine-protein kinase JAK3
Synonyms:
JAK3_MOUSE | Jak3
Type:
PROTEIN
Mol. Mass.:
122646.85
Organism:
Mus musculus
Description:
ChEMBL_1368188
Residue:
1100
  
Inhibitor
Name:
BDBM50021655
Synonyms:
DECERNOTINIB US10766894, Compound TABLE 1.2 VRT-831509 | VX-509
Type:
Small organic molecule
Emp. Form.:
C18H19F3N6O
Mol. Mass.:
392.3783
SMILES:
CC[C@@](C)(Nc1ccnc(n1)-c1c[nH]c2ncccc12)C(=O)NCC(F)(F)F
: