Target
Non-receptor tyrosine-protein kinase TYK2
Ligand
BDBM50021656
Substrate
Meas. Tech.
ChEMBL_1368155 (CHEMBL3299203)
IC50
61±n/a nM
Citation
 Clark, JDFlanagan, METelliez, JB Discovery and development of Janus kinase (JAK) inhibitors for inflammatory diseases. J Med Chem 57:5023-38 (2014)  
Target
Name:
Non-receptor tyrosine-protein kinase TYK2
Synonyms:
Non-receptor tyrosine-protein kinase TYK2 (TYK2) TYK2_HUMAN | Tyrosine-protein kinase TYK2
Type:
Protein
Mol. Mass.:
133666.03
Organism:
Homo sapiens (Human)
Description:
P29597
Residue:
1187
  
Inhibitor
Name:
BDBM50021656
Synonyms:
BARICITINIB LY-3009104 US10766894, Compound TABLE 1.19 US11203595, TABLE 1.19 US20230416237, Example baricitinib
Type:
Small organic molecule
Emp. Form.:
C16H17N7O2S
Mol. Mass.:
371.417
SMILES:
CCS(=O)(=O)N1CC(CC#N)(C1)n1cc(cn1)-c1ncnc2[nH]ccc12
: