Target
Muscarinic acetylcholine receptor M3
Ligand
BDBM50021935
Substrate
Meas. Tech.
ChEMBL_1367096
Ki
0.100000±n/a nM
Citation
 Nagashima, SMatsushima, YHamaguchi, HNagata, HKontani, TMoritomo, AKoshika, TTakeuchi, M Novel quinuclidinyl heteroarylcarbamate derivatives as muscarinic receptor antagonists. Bioorg Med Chem 22:3478-87 (2014)  
Target
Name:
Muscarinic acetylcholine receptor M3
Synonyms:
ACM3_RAT Chrm-3 | Chrm3
Type:
Enzyme Catalytic Domain
Mol. Mass.:
66086.66
Organism:
RAT
Description:
Cholinergic, muscarinic M3 CHRM3 RAT::P08483
Residue:
589
  
Inhibitor
Name:
BDBM50021935
Synonyms:
CHEMBL3298600
Type:
Small organic molecule
Emp. Form.:
C18H21FIN3O2S
Mol. Mass.:
489.346
SMILES:
[I-].C[N+]12CCC(CC1)(CC2)OC(=O)Nc1ncsc1-c1ccc(F)cc1
: